Évolution (biologie)
related: cb11949135s
P61160: http://www.rdaregistry.info/termList/statIdentification/1001
scope note: Sous cette vedette, on trouve les documents sur la description et l'explication de faits qui illustrent les théories de l'évolution. Les documents sur les théories et leurs implications philosophiques se trouvent sous Évolutionnisme
narrower: https://data.bnf.fr/ark:/12148/cb120495793
alternative label: Espèces (biologie) -- Évolution
related: https://data.bnf.fr/ark:/12148/cb158810573
narrower: https://data.bnf.fr/ark:/12148/cb131699746
FRBNF: 12423905
related: https://data.bnf.fr/ark:/12148/cb12267513f
narrower: https://data.bnf.fr/ark:/12148/cb13743475b
narrower: cb11932565x
is part of: r166
narrower: cb11945814s
created: 1994-10-13
related: https://data.bnf.fr/ark:/12148/cb119422283
alternative label: Évolution biologique
narrower: https://data.bnf.fr/ark:/12148/cb179820762
type: Concept
related: cb11931307z
narrower: cb12278188p
related: cb12108566v
related: cb11952878h
alternative label: Vie (biologie) -- Évolution
alternative label: Évolution des êtres vivants
scope note: Voir aussi la subdivision Variabilité aux êtres vivants
broader: https://data.bnf.fr/ark:/12148/cb119440835
scope note: Voir aussi la subdivision Évolution aux êtres vivants, parties du corps et produits chimiques (biomolécules)
alternative label: Espèces (biologie), Évolution des
related: cb12442136q
related match: Evolution (Biology)
related: cb12457944z
narrower: https://data.bnf.fr/ark:/12148/cb170055659
related: https://data.bnf.fr/ark:/12148/cb124239927
narrower: https://data.bnf.fr/ark:/12148/cb11932028b
related: cb13543877s
domaine: https://data.bnf.fr/ark:/12148/cb119440835
alternative label: Biologie évolutive
modified: 2023-06-08
narrower: https://data.bnf.fr/ark:/12148/cb119408377
related: cb13539870m
related: https://data.bnf.fr/ark:/12148/cb11938478f
related: cb17846733p
narrower: cb12485156w
narrower: cb11965244g
narrower: https://data.bnf.fr/ark:/12148/cb131848922
editorial note: Grand dict. encyclopédique Larousse. - . - Encycl. universalis. - http://www.universalis-edu.com. - 2009-02-16
narrower: cb11967850j
narrower: cb17832727k