Ensemble instrumental, Musique d'
narrower: cb16593795w
narrower: https://data.bnf.fr/ark:/12148/cb146215254
narrower: https://data.bnf.fr/ark:/12148/cb15065160f
narrower: https://data.bnf.fr/ark:/12148/cb16237468c
narrower: https://data.bnf.fr/ark:/12148/cb146334006
narrower: https://data.bnf.fr/ark:/12148/cb166872049
type: Concept
narrower: https://data.bnf.fr/ark:/12148/cb146294771
narrower: cb17750034p
narrower: https://data.bnf.fr/ark:/12148/cb170851635
narrower: cb14620615v
narrower: https://data.bnf.fr/ark:/12148/cb12344633c
narrower: https://data.bnf.fr/ark:/12148/cb146268077
alternative label: Ensembles (musique)
narrower: cb15114297z
modified: 2023-06-08
narrower: cb14621161w
alternative label: Ensembles instrumentaux
broader: https://data.bnf.fr/ark:/12148/cb11957378b
alternative label: Musique d'ensemble instrumental
narrower: cb16500519n
narrower: cb12310516x
narrower: cb14628272h
narrower: cb14625284s
narrower: https://data.bnf.fr/ark:/12148/cb146205387
narrower: https://data.bnf.fr/ark:/12148/cb14624839c
narrower: cb14624576r
narrower: cb16517151x
FRBNF: 12532146
narrower: cb17886673g
narrower: cb14620789p
related: cb14628294t
narrower: https://data.bnf.fr/ark:/12148/cb166483416
narrower: https://data.bnf.fr/ark:/12148/cb146329726
narrower: https://data.bnf.fr/ark:/12148/cb17931685d
created: 1996-09-30
narrower: https://data.bnf.fr/ark:/12148/cb136031776
narrower: cb17886665v
narrower: cb17069989m
is part of: r166
in scheme: rameau
alternative label: Musique d'ensemble
alternative label: Sonates (ensemble instrumental)
alternative label: Ensemble, Musique d'
scope note: Sous cette vedette, on trouve les compositions (qui n'ont pas de forme ou de genre particulier) pour au moins dix instruments solos de différentes familles, ainsi que les recueils de compositions pour n'importe quel nombre ou n'importe quelle combinaison d'instruments solos de différentes familles. Les compositions pour ensembles d'instruments solos identiques ou de même famille se trouvent sous les vedettes spécifiques, par ex. : Ensemble à cordes, Musique d' ; Ensemble de pianos, Musique d' ; etc
narrower: cb12285712k
narrower: cb12297891p
narrower: cb16536468n
narrower: https://data.bnf.fr/ark:/12148/cb123006687
narrower: cb16279050h
scope note: Voir aussi les vedettes de musique comprenant l'expression "ensemble instrumental". Celle-ci désigne n'importe quel nombre ou combinaison d'instruments lorsqu'elle est employée conjointement avec un ou plusieurs instruments solos ou comme précision d'accompagnement, par ex. : Flûte et ensemble instrumental ; Choeurs sacrés acc. d'ensemble instrumental
P61160: http://www.rdaregistry.info/termList/statIdentification/1001
narrower: https://data.bnf.fr/ark:/12148/cb146205325
narrower: cb17134543j
domaine: https://data.bnf.fr/ark:/12148/cb133183660
narrower: https://data.bnf.fr/ark:/12148/cb16520172d
is part of: Genre
narrower: https://data.bnf.fr/ark:/12148/cb15933125c

Genre
type: Collection
type: ConceptGroup
member: Ensemble instrumental, Musique d'

RAMEAU (Répertoire d'autorité-matière encyclopédique et alphabétique unifié)
type: ConceptScheme

Instrumental ensembles