Machines agricoles
narrower: cb11944598k
modified: 2018-12-07
narrower: https://data.bnf.fr/ark:/12148/cb131760161
narrower: cb12256635k
narrower: https://data.bnf.fr/ark:/12148/cb125256535
narrower: https://data.bnf.fr/ark:/12148/cb13162907c
narrower: cb11984941j
domaine litteral: Agriculture. Pêche
editorial note: Grand Larousse universel (art. : Machine ; Mécanisation). - . - Grand Robert de la langue française, 2001 (art. : Machine). - . -
narrower: https://data.bnf.fr/ark:/12148/cb121984533
domaine: cb11933639w
alternative label: Cultures -- Machines
related: cb11973435s
related: cb11934833m
related: cb12003696p
alternative label: Engins agricoles
alternative label: Machinisme agricole
created: 1985-07-06
related: https://data.bnf.fr/ark:/12148/cb120983738
related: https://data.bnf.fr/ark:/12148/cb11985282f
P61160: http://www.rdaregistry.info/termList/statIdentification/1001
narrower: cb15046789n
related: https://data.bnf.fr/ark:/12148/cb120105183
broader: https://data.bnf.fr/ark:/12148/cb131626829
is part of: r166
alternative label: Exploitations agricoles -- Machines
narrower: https://data.bnf.fr/ark:/12148/cb12309169c
scope note: Voir aussi la subdivision Appareils et matériel aux sujets noms communs appropriés (domaines, procédés relevant de l'agriculture), par ex. : Engrais et amendements -- Appareils et matériel
broader: https://data.bnf.fr/ark:/12148/cb13162847b
narrower: cb11964840h
related: https://data.bnf.fr/ark:/12148/cb11932449d
alternative label: Agriculture -- Machines
related: https://data.bnf.fr/ark:/12148/cb119778513
FRBNF: 13162681
type: Concept

Agricultural machinery