Exercices physiques
narrower: https://data.bnf.fr/ark:/12148/cb131639126
narrower: https://data.bnf.fr/ark:/12148/cb126521290
narrower: cb11954017k
related: https://data.bnf.fr/ark:/12148/cb169902824
type: Concept
P61160: http://www.rdaregistry.info/termList/statIdentification/1001
related: cb13162671n
modified: 2018-12-07
narrower: https://data.bnf.fr/ark:/12148/cb16606021f
broader: cb11945860z
alternative label: Exercices d'assouplissement
narrower: https://data.bnf.fr/ark:/12148/cb131628867
created: 1985-07-06
alternative label: Assouplissements
is part of: r166
FRBNF: 13162712
domaine litteral: Sports et jeux
narrower: https://data.bnf.fr/ark:/12148/cb131631589
scope note: Sous cette vedette, on trouve les documents sur les différentes méthodes d'entretien de la forme physique. Les documents sur les sports gymniques de compétition se trouvent sous Gymnastique
narrower: https://data.bnf.fr/ark:/12148/cb11958143c
editorial note: Trésor de la langue française (art. : Footing ; Physique). - . - Encycl. universalis (art. : Sport (Histoire et société) - Histoire). - http://www.universalis-edu.com. - 2013-03-27
alternative label: Fitness (exercices physiques)
related: https://data.bnf.fr/ark:/12148/cb123387860
alternative label: Exercices musculaires
narrower: cb11946973t
related match: Exercise
narrower: https://data.bnf.fr/ark:/12148/cb119790772
narrower: cb11940922g
alternative label: Exercices de remise en forme
domaine: https://data.bnf.fr/ark:/12148/cb119832928
narrower: cb12214387p
alternative label: Remise en forme, Exercices de
alternative label: Activité physique
narrower: cb16657184w
narrower: cb15525032z
narrower: cb15068326j
related: cb11953111j
narrower: cb13319971g
narrower: https://data.bnf.fr/ark:/12148/cb119760989
related: https://data.bnf.fr/ark:/12148/cb133188907
alternative label: Exercice physique
narrower: https://data.bnf.fr/ark:/12148/cb126497174
related: https://data.bnf.fr/ark:/12148/cb119383843
scope note: S'emploie également en subdivision. Cette subdivision s'applique aux parties du corps, par ex. : Muscles de l'abdomen -- Exercices physiques
narrower: cb12145749x
narrower: cb12098200s