Monnaie
domaine litteral: Économie politique. Travail
narrower: https://data.bnf.fr/ark:/12148/cb119709672
alternative label: Cours des monnaies
broader: cb11934161x
FRBNF: 13318359
P61160: http://www.rdaregistry.info/termList/statIdentification/1001
narrower: https://data.bnf.fr/ark:/12148/cb177162743
modified: 2023-06-08
created: 1985-07-06
narrower: https://data.bnf.fr/ark:/12148/cb166226624
alternative label: Moneta @it
narrower: https://data.bnf.fr/ark:/12148/cb171492821
alternative label: Devises (monnaie)
alternative label: Numéraire
is part of: r166
narrower: cb11950119k
narrower: cb11976667p
narrower: cb11959210x
related: https://data.bnf.fr/ark:/12148/cb119677899
broader: https://data.bnf.fr/ark:/12148/cb119512162
narrower: https://data.bnf.fr/ark:/12148/cb119542608
scope note: Voir aussi aux différentes monnaies, par ex. : Franc francais ; et aux expressions composées à partir du mot monnaie
type: Concept
alternative label: Espèces monnayées
narrower: cb11977976q
narrower: https://data.bnf.fr/ark:/12148/cb17740301b
scope note: Sous cette vedette, on trouve les documents sur l'aspect théorique de l'argent. Les documents de littérature courante sont sous Argent (monnaie)
narrower: cb13318452k
related: cb13553892w
narrower: cb11981388t
related: https://data.bnf.fr/ark:/12148/cb12495094c
narrower: cb13516317n
related: https://data.bnf.fr/ark:/12148/cb119759438
related match: Money
narrower: https://data.bnf.fr/ark:/12148/cb11977975c
narrower: https://data.bnf.fr/ark:/12148/cb119500613
narrower: https://data.bnf.fr/ark:/12148/cb13319216d
related: cb13516317n
broader: cb11961031m

Moneta