Renaissance
related: cb11973624p
narrower: cb12221891s
related: cb11993774x
related: https://data.bnf.fr/ark:/12148/cb12073865d
narrower: cb12010204k
narrower: cb12651250v
P61160: http://www.rdaregistry.info/termList/statIdentification/1001
narrower: cb11938803n
broader: https://data.bnf.fr/ark:/12148/cb133185865
alternative label: Contribution au concept de Renaissance
domaine: https://data.bnf.fr/ark:/12148/cb119344445
narrower: https://data.bnf.fr/ark:/12148/cb11947466d
narrower: cb12105664q
scope note: Voir aussi la subdivision Influence de la Renaissance aux sujets noms communs appropriés (artistiques, culturels, littéraires et de civilisation en général)
narrower: cb12295237r
alternative label: Renaissance -- Histoire
alternative label: Europe -- Civilisation -- Renaissance
narrower: cb11944995n
narrower: cb16924992w
alternative label: Civilisation de la Renaissance
scope note: Voir aussi la subdivision chronologique affranchie Renaissance
FRBNF: 13318531
is part of: r167
narrower: https://data.bnf.fr/ark:/12148/cb119458739
is part of: r166
modified: 2023-06-07
alternative label: Civilisation -- Renaissance
created: 1985-07-06
narrower: https://data.bnf.fr/ark:/12148/cb120696711
alternative label: Renaissance -- Europe
broader: cb11995030v
type: Concept
related: https://data.bnf.fr/ark:/12148/cb119789194

Renaissance