Campagne
narrower: https://data.bnf.fr/ark:/12148/cb119826568
narrower: cb11939034z
is part of: r166
narrower: https://data.bnf.fr/ark:/12148/cb119793051
related: https://data.bnf.fr/ark:/12148/cb11934135c
P61160: http://www.rdaregistry.info/termList/statIdentification/1001
narrower: https://data.bnf.fr/ark:/12148/cb161677094
alternative label: Environnement rural
broader: https://data.bnf.fr/ark:/12148/cb12007380f
editorial note: Grand Larousse universel. - . - Dict. de la géographie / P. George, 1974. - . - Les mots de la géographie / R. Brunet, 1993. - . -
narrower: https://data.bnf.fr/ark:/12148/cb119314375
alternative label: Régions rurales
alternative label: Espaces ruraux
alternative label: Campagnes
FRBNF: 15097982
scope note: Sous cette vedette, on trouve les documents sur la campagne en tant qu'espace rural par opposition aux villes, ou comme espace intérieur opposé à la mer ou la montagne. - Les documents sur les conditions économiques et sociales des campagnes se trouvent sous la vedette Conditions rurales ; ceux qui traitent de la vie à la campagne sont sous la vedette Vie rurale
domaine: cb11955444t
narrower: cb16278021p
created: 2006-09-22
type: Concept
alternative label: Espace rural
related: cb12355639w
alternative label: Zones rurales
modified: 2021-12-02
related: https://data.bnf.fr/ark:/12148/cb119346452
narrower: https://data.bnf.fr/ark:/12148/cb179838426
related: https://data.bnf.fr/ark:/12148/cb119409810