Physique -- Philosophie
related: https://data.bnf.fr/ark:/12148/cb119571225
related: cb11933127h
type: Concept
related match: Physics--Philosophy
related: https://data.bnf.fr/ark:/12148/cb145006216
broader: cb11933233q
domaine: https://data.bnf.fr/ark:/12148/cb119368422
P61160: http://www.rdaregistry.info/termList/statIdentification/1001
created: 1985-07-06
FRBNF: 11938459
domaine: cb11933127h
related: https://data.bnf.fr/ark:/12148/cb119378936
modified: 2023-06-08
alternative label: Philosophie de la physique
alternative label: Épistémologie de la physique
is part of: r166
scope note: Sous cette vedette, on trouve les documents sur la philosophie de la physique. Les documents sur les relations entre la philosophie et la physique se trouvent sous Philosophie et physique