Église et société
narrower: https://data.bnf.fr/ark:/12148/cb133183978
broader: https://data.bnf.fr/ark:/12148/cb120498281
alternative label: Christianisme et le monde
type: Concept
FRBNF: 11960434
alternative label: Société et l'Église
alternative label: Monde (théologie chrétienne)
narrower: cb12652252s
P61160: http://www.rdaregistry.info/termList/statIdentification/1001
related: https://data.bnf.fr/ark:/12148/cb119317072
alternative label: Église et le monde
modified: 2017-12-04
narrower: https://data.bnf.fr/ark:/12148/cb119346781
narrower: https://data.bnf.fr/ark:/12148/cb119813504
scope note: Peut se subdiviser par confession
alternative label: Siècle (théologie chrétienne)
narrower: cb11965572j
created: 1985-07-06
narrower: https://data.bnf.fr/ark:/12148/cb119522436
scope note: Sous cette vedette, on trouve les documents qui traitent de la position et des responsabilités de l'Église dans la société
alternative label: Monde et l'Église
domaine: cb11963568t
is part of: r166
domaine litteral: Sciences sociales. Sociologie
narrower: https://data.bnf.fr/ark:/12148/cb119659494

Church and the world