Chevaux de course
narrower: https://data.bnf.fr/ark:/12148/cb119624042
P61160: http://www.rdaregistry.info/termList/statIdentification/1001
type: Concept
domaine: cb11933834q
is part of: r166
scope note: Voir aussi aux noms des chevaux de course célèbres, par ex. : Ourasi (cheval de course)
alternative label: Chevaux de courses hippiques
broader: https://data.bnf.fr/ark:/12148/cb131853651
related: cb11958117t
related match: Race horses
FRBNF: 11971082
created: 1985-07-06
narrower: cb11933004k
modified: 2018-09-11