Tangos
modified: 2023-06-07
broader: https://data.bnf.fr/ark:/12148/cb12048235d
P61160: http://www.rdaregistry.info/termList/statIdentification/1001
scope note: Voir aussi les vedettes du type Tangos [distribution instrumentale], par ex. : Tangos (piano)
FRBNF: 12049072
narrower: https://data.bnf.fr/ark:/12148/cb170885619
is part of: Genre
scope note: Sous cette vedette, on trouve les recueils de tangos pour diverses instrumentations. Les documents sur le tango en tant que danse se trouvent sous Tango (danse)
type: Concept
in scheme: rameau
editorial note: Dict. thématique des musiques du monde / É. Bours, 2002. - . - Dict. de la musique / M. Vignal, 2005. - . - Dict. encyclopédique de la musique / D. Arnold, 1988. - . -
is part of: r166
editorial note: Grand Larousse universel. - . - Encycl. universalis (art. : Musique créole). - http://www.universalis-edu.com. - 2011-04-04
alternative label: Tango (musique)
created: 1987-11-16
related: cb11949361w
domaine: https://data.bnf.fr/ark:/12148/cb133183660

Genre
type: ConceptGroup
type: Collection
member: Tangos

Tangos

RAMEAU (Répertoire d'autorité-matière encyclopédique et alphabétique unifié)
type: ConceptScheme