Astronomie
narrower: https://data.bnf.fr/ark:/12148/cb119317955
narrower: https://data.bnf.fr/ark:/12148/cb119776010
related: https://data.bnf.fr/ark:/12148/cb119480447
is part of: r166
narrower: cb14449813z
related: cb11933192z
narrower: https://data.bnf.fr/ark:/12148/cb17146507c
narrower: cb14541734w
narrower: https://data.bnf.fr/ark:/12148/cb18071275d
narrower: cb11966665s
related: https://data.bnf.fr/ark:/12148/cb119582518
narrower: https://data.bnf.fr/ark:/12148/cb12385200c
type: Concept
related: https://data.bnf.fr/ark:/12148/cb11945224f
created: 1985-07-06
related: cb13318456z
narrower: https://data.bnf.fr/ark:/12148/cb119470309
narrower: cb11977822h
scope note: S'emploie également en subdivision
narrower: https://data.bnf.fr/ark:/12148/cb119369174
alternative label: Corps célestes
narrower: https://data.bnf.fr/ark:/12148/cb12436758f
P61160: http://www.rdaregistry.info/termList/statIdentification/1001
modified: 2023-11-23
narrower: cb13505300g
narrower: https://data.bnf.fr/ark:/12148/cb11977605c
narrower: https://data.bnf.fr/ark:/12148/cb119780754
narrower: https://data.bnf.fr/ark:/12148/cb135145527
FRBNF: 13318302
narrower: cb11978636w
related: cb11969985z
related: cb13318746g
scope note: Voir aussi aux noms des corps célestes
related: https://data.bnf.fr/ark:/12148/cb119383576
narrower: https://data.bnf.fr/ark:/12148/cb119808988
narrower: https://data.bnf.fr/ark:/12148/cb119377185
related: cb11977198t
scope note: Voir aussi aux vedettes commençant par le mot Astronomie
narrower: https://data.bnf.fr/ark:/12148/cb119403324
narrower: cb15072342j
narrower: https://data.bnf.fr/ark:/12148/cb165614384
narrower: https://data.bnf.fr/ark:/12148/cb11934562c
related: cb11949655s
related: https://data.bnf.fr/ark:/12148/cb11936921c
narrower: cb11931367t
narrower: cb11976333j
narrower: https://data.bnf.fr/ark:/12148/cb155587071
narrower: https://data.bnf.fr/ark:/12148/cb119563810
narrower: https://data.bnf.fr/ark:/12148/cb13338351c
narrower: https://data.bnf.fr/ark:/12148/cb18071197f
narrower: https://data.bnf.fr/ark:/12148/cb137506908
narrower: cb11941212g
scope note: Voir aussi les vedette du type Astronomie [adjectif de civilisation ou ethnique], par ex. : Astronomie arabe ; Astronomie hindoue ; Astronomie navajo
narrower: https://data.bnf.fr/ark:/12148/cb124244687
narrower: https://data.bnf.fr/ark:/12148/cb119528802
alternative label: Astres
narrower: cb11944487n
narrower: https://data.bnf.fr/ark:/12148/cb120029352
narrower: https://data.bnf.fr/ark:/12148/cb119780696
narrower: https://data.bnf.fr/ark:/12148/cb12043398c
related: cb11941552j
alternative label: Et l'astronomie
narrower: cb11932495k
narrower: cb12105240m
related: https://data.bnf.fr/ark:/12148/cb119587462
narrower: https://data.bnf.fr/ark:/12148/cb12494894b
related: cb16740871r
narrower: cb11944346s
narrower: https://data.bnf.fr/ark:/12148/cb119761706
narrower: https://data.bnf.fr/ark:/12148/cb11931717c

Astronomy