Philosophie de la religion
alternative label: Contribution à la philosophie de la religion
narrower: cb11963403z
broader: https://data.bnf.fr/ark:/12148/cb119368422
narrower: cb11969140s
narrower: cb11942372v
domaine: https://data.bnf.fr/ark:/12148/cb119368422
narrower: https://data.bnf.fr/ark:/12148/cb119517420
P61160: http://www.rdaregistry.info/termList/statIdentification/1001
type: Concept
narrower: cb11937191k
narrower: https://data.bnf.fr/ark:/12148/cb119669408
narrower: https://data.bnf.fr/ark:/12148/cb177160240
alternative label: Philosophie des religions
scope note: Voir aussi les vedettes du type : Philosophie [adjectif de religion] ainsi que les vedettes du type : [Nom de religion] -- Doctrines
related: https://data.bnf.fr/ark:/12148/cb119329531
alternative label: Religion -- Philosophie
domaine: cb11963568t
narrower: cb11942393t
narrower: cb12269725g
editorial note: Philosophie de la religion / L. Kolakowski, 1985. - . - Introduction à la philosophie de la religion / F. Kaplan, J.-L. Vieillard-Baron, 1989. - . - La philosophie de la religion / J. Grondin, 2009. - . -
narrower: cb11938278w
alternative label: Religions -- Philosophie
related: cb11963568t
narrower: https://data.bnf.fr/ark:/12148/cb181390843
narrower: cb15829375j
scope note: S'emploie également en subdivision
narrower: https://data.bnf.fr/ark:/12148/cb11953456b
FRBNF: 13318611
modified: 2023-06-07
is part of: r166
narrower: cb11960407m
narrower: cb11935481m
created: 1985-07-06

Religion--Philosophy