Accouchement
editorial note: Grand dict. encyclopédique Larousse. - . - Encycl. universalis. - http://www.universalis-edu.com. - 2017-02-02
narrower: https://data.bnf.fr/ark:/12148/cb180969780
narrower: cb12047107n
alternative label: Enfantement (biologie)
is part of: r166
related: https://data.bnf.fr/ark:/12148/cb11976961f
related: cb18034661q
domaine: https://data.bnf.fr/ark:/12148/cb119440835
type: Concept
alternative label: Travail obstétrical
scope note: Sous cette vedette, on trouve les documents sur les aspects physiologiques de la naissance humaine. Les documents techniques sur le déroulement du travail se trouvent sous Obstétrique. Les documents relatifs au contexte qui accompagne la mise au monde de l'enfant se trouvent sous Naissance
P61160: http://www.rdaregistry.info/termList/statIdentification/1001
narrower: https://data.bnf.fr/ark:/12148/cb181196892
narrower: cb11967766n
related: cb12318279x
created: 1985-07-06
FRBNF: 11931223
related: https://data.bnf.fr/ark:/12148/cb165345809
modified: 2023-06-07
broader: cb11958962v
narrower: cb18047207r
alternative label: Travail (obstétrique)
related: cb18119637t
narrower: https://data.bnf.fr/ark:/12148/cb119823464
related: cb15003021j
related: https://data.bnf.fr/ark:/12148/cb120021575
narrower: https://data.bnf.fr/ark:/12148/cb119941944
related: cb17765784k
related: https://data.bnf.fr/ark:/12148/cb131731366
related: https://data.bnf.fr/ark:/12148/cb119580313
narrower: https://data.bnf.fr/ark:/12148/cb119440448
scope note: Voir aussi la subdivision Parturition aux êtres vivants (animaux)
domaine: https://data.bnf.fr/ark:/12148/cb119832928
related: cb12318276w
related: cb11932338g
related: https://data.bnf.fr/ark:/12148/cb11932879f

Childbirth

Parturition