France (nord)
narrower: cb11974020w
scope note: Sous cette vedette, on trouve les documents qui traitent de la moitié nord de la France
modified: 2017-05-02
alternative label: Nord de la France
FRBNF: 11931524
alternative label: France septentrionale
is part of: r167
narrower: cb11974019p
broader: https://data.bnf.fr/ark:/12148/cb119314762
domaine litteral: Géographie de la France
type: Concept
P61160: http://www.rdaregistry.info/termList/statIdentification/1001
created: 1985-07-06
alternative label: France du nord

France, Northern