Mécanique
scope note: Voir aussi les vedettes commençant par Mécanique
FRBNF: 11932446
related: https://data.bnf.fr/ark:/12148/cb131626829
narrower: cb11983251p
alternative label: Mécanique du solide
narrower: cb11978025k
narrower: cb11973906k
narrower: https://data.bnf.fr/ark:/12148/cb119765960
narrower: https://data.bnf.fr/ark:/12148/cb12337788f
P61160: http://www.rdaregistry.info/termList/statIdentification/1001
narrower: https://data.bnf.fr/ark:/12148/cb11966751c
narrower: https://data.bnf.fr/ark:/12148/cb119780247
narrower: cb11978028m
alternative label: Mécanique des solides déformables
narrower: cb11979893h
narrower: cb11977909k
related match: Mechanics
narrower: cb11935833v
narrower: cb11939607q
narrower: cb11941523z
related: https://data.bnf.fr/ark:/12148/cb119314344
narrower: cb12506375g
broader: https://data.bnf.fr/ark:/12148/cb11932434c
broader: cb11933127h
narrower: cb11955413j
type: Concept
domaine: https://data.bnf.fr/ark:/12148/cb11932434c
narrower: cb13336090z
domaine: cb11933127h
narrower: https://data.bnf.fr/ark:/12148/cb11977870c
narrower: cb11966550g
alternative label: Mécanique des solides
modified: 2023-06-08
narrower: cb12322252n
narrower: cb11978029z
scope note: Voir aussi la subdivision Propriétés mécaniques aux êtres vivants, matériaux, parties du corps, produits chimiques et sujets noms communs appropriés
narrower: cb11944487n
narrower: cb11940775h
alternative label: Mécanique des systèmes discrets
narrower: cb11966647v
narrower: https://data.bnf.fr/ark:/12148/cb119328485
narrower: https://data.bnf.fr/ark:/12148/cb119324482
narrower: cb11966679g
narrower: cb11978022j
alternative label: Mécanique du point matériel
alternative label: Mécanique du point
narrower: cb11978023w
narrower: cb11931958h
narrower: https://data.bnf.fr/ark:/12148/cb135087934
narrower: https://data.bnf.fr/ark:/12148/cb119778664
is part of: r166
created: 1985-07-06
narrower: cb11947049q
narrower: cb11977123x
narrower: cb11978026x
narrower: https://data.bnf.fr/ark:/12148/cb119403951