Mexique
related: cb16084619p
modified: 2017-02-13
related: cb11930875k
related: https://data.bnf.fr/ark:/12148/cb12242620c
created: 1985-07-06
narrower: https://data.bnf.fr/ark:/12148/cb120253377
narrower: https://data.bnf.fr/ark:/12148/cb16572970f
narrower: cb12025336w
broader: https://data.bnf.fr/ark:/12148/cb171215021
narrower: https://data.bnf.fr/ark:/12148/cb12490969f
related: https://data.bnf.fr/ark:/12148/cb12469417c
scope note: Voir aussi la subdivision Et le Mexique aux personnes et collectivités
P61160: http://www.rdaregistry.info/termList/statIdentification/1001
related: cb12032505n
narrower: https://data.bnf.fr/ark:/12148/cb121215130
editorial note: IFLA, Names of states, 1981. - . - Grand Larousse Universel. - . -
narrower: https://data.bnf.fr/ark:/12148/cb121267999
related: https://data.bnf.fr/ark:/12148/cb121210995
type: Concept
related: cb12393292k
narrower: https://data.bnf.fr/ark:/12148/cb12727738c
narrower: cb12163667h
FRBNF: 11932500
domaine litteral: Géographie du reste du monde
related: cb17134934p
narrower: cb12411709m
is part of: r167

Mexico