Qualité -- Contrôle
alternative label: Gestion de la qualité
alternative label: Qualité, Contrôle de la
narrower: cb12260970p
related: https://data.bnf.fr/ark:/12148/cb119772774
broader: cb11950206h
alternative label: Surveillance de la qualité
alternative label: Contrôle de qualité
narrower: https://data.bnf.fr/ark:/12148/cb125092392
narrower: cb11983125v
narrower: https://data.bnf.fr/ark:/12148/cb119774859
scope note: Sous cette vedette, on trouve les documents sur les règles utilisées et les vérifications exercées pour établir et maintenir des variations acceptables de la qualité des produits ou services
scope note: S'emploie également en subdivision aux industries, matériaux et sujets noms communs appropriés (types d'installations, de procédés, produits, etc.) pour les règles et les vérifications destinées à maintenir une variation acceptable de la qualité
related match: Quality control
type: Concept
alternative label: Contrôle de la qualité
P61160: http://www.rdaregistry.info/termList/statIdentification/1001
alternative label: Qualité -- Gestion
broader: cb13318399z
narrower: cb12453994j
narrower: https://data.bnf.fr/ark:/12148/cb12470916f
narrower: https://data.bnf.fr/ark:/12148/cb123228451
broader: https://data.bnf.fr/ark:/12148/cb119709808
narrower: cb11976414j
domaine: cb11950206h
alternative label: Audit de la qualité
alternative label: Qualité -- Audit
FRBNF: 11932687
narrower: https://data.bnf.fr/ark:/12148/cb135053323
broader: https://data.bnf.fr/ark:/12148/cb119395888
related: cb17069361k
narrower: cb11967847n
narrower: https://data.bnf.fr/ark:/12148/cb13554817c
narrower: https://data.bnf.fr/ark:/12148/cb121518452
alternative label: Qualitique
modified: 2023-06-08
related: cb11947028r
narrower: cb11992380h
narrower: https://data.bnf.fr/ark:/12148/cb124974103
is part of: r166
related: https://data.bnf.fr/ark:/12148/cb135064391
narrower: https://data.bnf.fr/ark:/12148/cb11942902b
narrower: cb16238916r
alternative label: Contrôle qualité
created: 1985-07-06
narrower: https://data.bnf.fr/ark:/12148/cb120450892
narrower: cb12556349z
alternative label: Niveau de qualité acceptable
broader: https://data.bnf.fr/ark:/12148/cb119587400