Peintres
narrower: cb11938693w
narrower: https://data.bnf.fr/ark:/12148/cb123854943
domaine litteral: Catégories de personnes
type: Concept
scope note: Voir aussi les vedettes du type Peintres [adjectif de nationalité ou géographique]
narrower: cb12031741t
narrower: cb12450513w
narrower: cb11981315m
broader: cb13318455m
related: https://data.bnf.fr/ark:/12148/cb11932942c
narrower: cb11946261w
narrower: https://data.bnf.fr/ark:/12148/cb123855006
narrower: cb11961439g
domaine: https://data.bnf.fr/ark:/12148/cb11932942c
narrower: cb12385498g
related match: Painters
alternative label: Artistes peintres
modified: 2023-06-07
narrower: cb12050148r
P61160: http://www.rdaregistry.info/termList/statIdentification/1001
editorial note: Nouveau petit Robert 1993. - . - Trésor de la langue française. - . -
narrower: https://data.bnf.fr/ark:/12148/cb123854823
narrower: cb11989910g
narrower: https://data.bnf.fr/ark:/12148/cb123854796
is part of: r166
narrower: cb12549031k
created: 1985-07-06
alternative label: Peintres (artistes)
narrower: cb16686627t
related: https://data.bnf.fr/ark:/12148/cb150958035
narrower: cb11999174q
narrower: cb16687325j
FRBNF: 11933053
narrower: https://data.bnf.fr/ark:/12148/cb119408942