Savoir et érudition
related: cb12469494t
modified: 2023-08-10
is part of: r166
scope note: Voir aussi les subdivisions du type Et [sujet], Et [nom géographique] aux collectivités et personnes
related: cb13318807v
broader: cb11931827z
related: cb11933880w
editorial note: Trésor de la langue française : Polymathie. - http://stella.atilf.fr. - 2023-08-10 La sagesse présocratique / Communication des savoirs en Grèce archaïque : des lieux et des hommes / M.-L. Desclos, F. Fronterotta, 2013 : polymathie. - . -
narrower: https://data.bnf.fr/ark:/12148/cb124467308
related match: Learning and scholarship
narrower: https://data.bnf.fr/ark:/12148/cb119474908
alternative label: Érudition
related match: Knowledge and learning
related: cb11938467s
narrower: cb12254343w
alternative label: Polymathie
related: https://data.bnf.fr/ark:/12148/cb11933785b
scope note: S'emploie également en subdivision aux personnes pour des études sur leur connaissances en général. - Pour leurs connaissances sur un sujet ou un lieu particulier, employer les subdivisions du type Et [sujet], Et [nom géographique]
related: https://data.bnf.fr/ark:/12148/cb150933964
related: cb11966930z
narrower: cb16620091k
related: https://data.bnf.fr/ark:/12148/cb123129991
created: 1985-07-06
alternative label: Savoirs
broader: cb13319049t
alternative label: Connaissances
related: https://data.bnf.fr/ark:/12148/cb12471041d
related: cb18100885v
related: cb16623657s
P61160: http://www.rdaregistry.info/termList/statIdentification/1001
FRBNF: 11933226
related: https://data.bnf.fr/ark:/12148/cb131833270
narrower: https://data.bnf.fr/ark:/12148/cb119458948
domaine litteral: Savoir et érudition. Musées
type: Concept
narrower: https://data.bnf.fr/ark:/12148/cb119331908

Tous les savoirs du monde : Le site complet
description: Dans une longue histoire intellectuelle qui va de Sumer au XXI e siècle, le site s'attache à saisir les moments forts de l'histoire de la pensée et du savoir, à faire découvrir des lieux privilégiés d'échanges intellectuels, d'enseignement ou de débat, et propose des rencontres avec les héros du savoir qui se répondent à travers les siècles. Innombrables sont les décors et les acteurs de l'encyclopédisme : Ninive au VII e siècle av. J.-C., Alexandrie au III e siècle av. J.-C., Bagdad au IX e siècle, Cordoue au X e siècle, Paris aux XII e -XIII e siècles, l'Italie aux XIV e -XV e siècles, l'Europe entière au XVIII e siècle, sans oublier la Chine dont la tradition encyclopédique s'étale majestueusement sur trois millénaires. Autant de foyers lumineux qui allument sur la carte du monde des univers nouveaux, ouvrant des brèches, inaugurant, découvrant, inventoriant, reclassant, inventant des technologies inédites (l'écriture, le livre, l'imprimerie, la bibliothèque). Autant de préludes à cette nouvelle étape de l'aventure encyclopédique que prépare la fin du XX e siècle, offrant virtuellement une disponibilité absolue de tous les textes sur tous les sites et faisant ainsi exploser la question des lieux du savoir. Dans cette histoire se côtoient serviteurs et seigneurs, inventeurs et compilateurs, empereurs ou princes exemplaires, scribes ou copistes anonymes parfois miraculeusement ressuscités au détour d'une inscription, calligraphes, imprimeurs, philosophes, savants, voyageurs ou explorateurs, tous habités d'une commune passion, celle d'étreindre la totalité du savoir, d'en saisir les articulations actives. Au-delà de cette foisonnante multiplicité, la démarche encyclopédique se ramène à des gestes fondamentaux constamment retrouvés : rassembler, classer et donner accès. Le dossier pédagogique définit des pistes de travail et propose questionnaires et atelier pour prolonger la réflexion.
type: Document
subject: Savoir et érudition
type: ExpositionVirtuelle