Sciences
related: cb12395786h
narrower: cb13174059t
related: cb16242905v
alternative label: Sciences pures
narrower: cb12010148x
related: cb17743237s
alternative label: Sciences fondamentales
narrower: cb18100885v
related: cb11933233q
related: cb11979383t
narrower: https://data.bnf.fr/ark:/12148/cb171446880
related: https://data.bnf.fr/ark:/12148/cb119497928
related: cb11946924m
narrower: https://data.bnf.fr/ark:/12148/cb150451872
narrower: https://data.bnf.fr/ark:/12148/cb11941945c
FRBNF: 11933232
related: cb12440054w
narrower: https://data.bnf.fr/ark:/12148/cb12048223d
scope note: S'emploie également en subdivision
related: https://data.bnf.fr/ark:/12148/cb11942313b
narrower: https://data.bnf.fr/ark:/12148/cb166107098
narrower: https://data.bnf.fr/ark:/12148/cb123662513
alternative label: Sciences exactes
modified: 2023-11-23
related: cb11955260h
related: cb15993600n
related: cb12332338k
related: cb17709677r
narrower: cb12318954h
narrower: cb11944415s
narrower: cb12062047t
narrower: https://data.bnf.fr/ark:/12148/cb120745812
P61160: http://www.rdaregistry.info/termList/statIdentification/1001
narrower: https://data.bnf.fr/ark:/12148/cb11979189b
narrower: https://data.bnf.fr/ark:/12148/cb11933235d
narrower: cb11938467s
related: https://data.bnf.fr/ark:/12148/cb11937247c
narrower: cb12062203r
created: 1985-07-06
narrower: https://data.bnf.fr/ark:/12148/cb11953324f
scope note: Voir aussi aux sciences, par ex. : Physique ; Météorologie, etc.
alternative label: Et les sciences
narrower: cb11933880w
narrower: https://data.bnf.fr/ark:/12148/cb12295224d
related: cb11945336q
narrower: cb12163045j
type: Concept
narrower: cb11947446s
related: https://data.bnf.fr/ark:/12148/cb124467308
narrower: cb11966975x
narrower: cb12385603h
related: https://data.bnf.fr/ark:/12148/cb11932536b
alternative label: Contribution aux sciences
narrower: cb12107695g
is part of: r166

Science