Tibet (Chine)
FRBNF: 11933498
modified: 2017-12-21
alternative label: Sitsang (Chine)
broader: cb11935913h
related: https://data.bnf.fr/ark:/12148/cb162424640
narrower: https://data.bnf.fr/ark:/12148/cb122451828
related: cb16517271t
P61160: http://www.rdaregistry.info/termList/statIdentification/1001
broader: cb12552522h
is part of: r167
alternative label: Bodyul (Chine)
scope note: Dans RAMEAU, les noms géographiques tibétains qui n'ont pas de forme française doivent être pris en translittération du tibétain et non sous une forme sinisée. - Le système de translittération utilisé est celui de la Bibliothèque du Congrès
note: Région autonome de la Chine depuis 1951
alternative label: Hsi-tsang (Chine)
related: https://data.bnf.fr/ark:/12148/cb11955055c
broader: https://data.bnf.fr/ark:/12148/cb12009832f
alternative label: Xizang zizhiqu (Chine) @zh
type: Concept
narrower: https://data.bnf.fr/ark:/12148/cb12314100d
created: 1985-07-06
alternative label: Thibet (Chine)
editorial note: GDEL. - . - Laval RVM, 1995-02. - . -
related: cb16237040w