Turquie
related: https://data.bnf.fr/ark:/12148/cb180779853
narrower: cb13771575r
narrower: https://data.bnf.fr/ark:/12148/cb121923808
related: cb11944568n
is part of: r167
related: https://data.bnf.fr/ark:/12148/cb121285230
domaine litteral: Géographie du reste du monde
related: https://data.bnf.fr/ark:/12148/cb119335446
scope note: Voir aussi la subdivision Et la Turquie [sans subd. géogr.] aux collectivités et aux personnes
type: Concept
related: https://data.bnf.fr/ark:/12148/cb119309824
related: https://data.bnf.fr/ark:/12148/cb131684152
related: cb15844652x
broader: https://data.bnf.fr/ark:/12148/cb11941591f
editorial note: Grand Larousse universel. - . - Robert encyclopédique des noms propres 2008. - . - Encycl. universalis. - http://www.universalis-edu.com. - 2016-12-02
narrower: https://data.bnf.fr/ark:/12148/cb119791253
related: cb12173297j
related: cb11935673j
narrower: cb11979526j
domaine litteral: Géographie de l'Europe
modified: 2016-12-02
created: 1985-07-06
related: cb12105195m
P61160: http://www.rdaregistry.info/termList/statIdentification/1001
related: https://data.bnf.fr/ark:/12148/cb124254136
scope note: Sous cette vedette, on trouve les documents sur la Turquie dans ses frontières actuelles, ou de la seule Anatolie (terme qui pour les Turcs désigne toute la Turquie d'Asie). Les documents sur l'ensemble de la Turquie avant 1922 se trouvent sous Empire ottoman ; ceux sur l'Anatolie antique, byzantine et ottomane se trouvent sous Asie Mineure
related: cb11982402s
FRBNF: 11933721
related: https://data.bnf.fr/ark:/12148/cb120749052
related: https://data.bnf.fr/ark:/12148/cb120050715
scope note: Voir aussi la subdivision Opinion publique turque [sans subd. géogr.] aux guerres et aux lieux

Turquie
long: 25.8666666666667
type: SpatialThing
lat: 35.8333333333333
cadre geographique: cwbz
lat: 42.0333333333333
lat long: E 25°52' - E 44°18' / N 42°2' - N 35°50'
long: 44.3
creationdu lieu: 1923

Turquie
created: 1989-01-12
focus: Turquie
type: Concept
alternative label: Turquie (1924-)
alternative label: Turquie d'Asie
modified: 2020-01-24
FRBNF: 15238442
alternative label: Türkiye @tr
P61160: http://www.rdaregistry.info/termList/statIdentification/1001
alternative label: Anatolie (Turquie)
alternative label: Anadolu (Turquie) @tr
related: https://data.bnf.fr/ark:/12148/cb153219920

Turkey