Vatican
alternative label: Stato della Città del Vaticano @it
modified: 2006-12-11
alternative label: Cité du Vatican
FRBNF: 15336233
alternative label: Vaticano @it
alternative label: État de la cité du Vatican
alternative label: Saint-Siège
type: Concept
alternative label: État de la Cité du Vatican
focus: Vatican
alternative label: Vatican, État de la Cité du
created: 1998-06-09
alternative label: Città del Vaticano @it
broader: https://data.bnf.fr/ark:/12148/cb153228145
P61160: http://www.rdaregistry.info/termList/statIdentification/1001
alternative label: Vatican (1929-)
alternative label: Rome (Italie) -- Città del Vaticano

Vatican
broader: https://data.bnf.fr/ark:/12148/cb119523157
FRBNF: 11933748
note: Partie de Rome constituant depuis le traité du Latran (11 février 1929) le territoire souverain du Saint-Siège. Le territoire de la Cité du Vatican comprend le Vatican proprement dit (Basilique Saint-Pierre, place Saint-Pierre, palais et jardins), les trois basiliques romaines de Saint-Jean de Latran, de Sainte-Marie-Majeure et de Saint-Paul hors-les-murs, la villa pontificale de Castelgandolfo, plusieurs palais abritant des organes de la Curie romaine et l'hôpital du Bambino Gesù
P61160: http://www.rdaregistry.info/termList/statIdentification/1001
scope note: Voir aussi aux différents lieux de la Cité du Vatican ou en dépendant, par ex. : Vatican -- Palazzo apostolico ; Rome (Italie) -- Basilica di San Giovanni in Laterano
related: cb15532514w
is part of: r167
related: cb11932804j
domaine litteral: Géographie de l'Europe
related: https://data.bnf.fr/ark:/12148/cb119747753
type: Concept
domaine: cb11963568t
related: https://data.bnf.fr/ark:/12148/cb119345700
editorial note: LC Authorities (en ligne), 2010-04-12 : Vatican City. - . - Laval RVM (en ligne), 2010-04-13. - . -
related: cb11963682n
modified: 2022-04-29
related: cb12320798v
editorial note: Grand Larousse universel : Vatican (État de la Cité du). - . - Encycl. universalis : Vatican, Cité du. - http://www.universalis-edu.com. - 2010-04-13 Encicl. italiana : Vaticano (Stato della Città del). - . -
created: 1985-07-06

Vatican
cadre geographique: cxbl
lat: 41.9
long: 12.45
lat long: E 12°27' / N 41°54'
type: SpatialThing