Arts du spectacle
narrower: cb13506373x
broader: cb11935712m
alternative label: Arts de la scène
related: https://data.bnf.fr/ark:/12148/cb119634091
alternative label: Et les arts du spectacle
related: https://data.bnf.fr/ark:/12148/cb119710325
related: https://data.bnf.fr/ark:/12148/cb161627046
narrower: cb13166347x
alternative label: Contribution aux arts du spectacle
related: cb13557768q
related: cb13318614k
scope note: Voir aussi la subdivision Représentations
narrower: cb13162689q
narrower: cb12385375j
related: https://data.bnf.fr/ark:/12148/cb121015278
narrower: https://data.bnf.fr/ark:/12148/cb122747124
is part of: r166
related: cb12257821p
related: cb16691465t
alternative label: Oeuvres -- Arts du spectacle
related: https://data.bnf.fr/ark:/12148/cb123376943
narrower: https://data.bnf.fr/ark:/12148/cb17101075f
related: https://data.bnf.fr/ark:/12148/cb150961024
related: https://data.bnf.fr/ark:/12148/cb11982398c
related: https://data.bnf.fr/ark:/12148/cb13735976b
related: https://data.bnf.fr/ark:/12148/cb122384233
related: https://data.bnf.fr/ark:/12148/cb122147017
related: cb11940021n
narrower: https://data.bnf.fr/ark:/12148/cb16260691c
related: cb11952386r
narrower: cb15059314k
narrower: cb14587744g
FRBNF: 11933908
narrower: https://data.bnf.fr/ark:/12148/cb131630581
type: Concept
has bibliography: Bibliographie-Droit(s)-et-spectacle-vivant.pdf
narrower: https://data.bnf.fr/ark:/12148/cb16259823d
related: https://data.bnf.fr/ark:/12148/cb16260691c
alternative label: Spectacle vivant
note: Aspect technique, créatif et artistique du spectacle vivant
related: cb12652603p
narrower: https://data.bnf.fr/ark:/12148/cb155868094
narrower: https://data.bnf.fr/ark:/12148/cb11931206b
related: https://data.bnf.fr/ark:/12148/cb135708394
related: cb13319740n
related: https://data.bnf.fr/ark:/12148/cb119321038
related: https://data.bnf.fr/ark:/12148/cb122207484
narrower: cb12558500n
related: cb14518706q
related: cb12340880g
narrower: https://data.bnf.fr/ark:/12148/cb11982479c
related: cb15019509q
narrower: cb11931841h
scope note: S'emploie également en subdivision
alternative label: Arts d'interprétation
created: 1985-07-06
narrower: https://data.bnf.fr/ark:/12148/cb11938012d
alternative label: Arts du spectacle vivant
narrower: https://data.bnf.fr/ark:/12148/cb124538394
P61160: http://www.rdaregistry.info/termList/statIdentification/1001
narrower: https://data.bnf.fr/ark:/12148/cb119367643
related: https://data.bnf.fr/ark:/12148/cb150722935
narrower: cb12314170k
related: https://data.bnf.fr/ark:/12148/cb178101825
narrower: https://data.bnf.fr/ark:/12148/cb167651180
narrower: cb12503525r
narrower: https://data.bnf.fr/ark:/12148/cb13163871f
modified: 2024-04-17

Performing arts