Histoire universelle
related: cb13536505m
FRBNF: 11934222
alternative label: Monde -- Histoire
P61160: http://www.rdaregistry.info/termList/statIdentification/1001
narrower: https://data.bnf.fr/ark:/12148/cb133185207
narrower: https://data.bnf.fr/ark:/12148/cb119760222
alternative label: Histoire du monde
created: 1985-07-06
alternative label: Histoire générale
related: https://data.bnf.fr/ark:/12148/cb135365017
domaine: https://data.bnf.fr/ark:/12148/cb119344445
related: https://data.bnf.fr/ark:/12148/cb120442641
narrower: https://data.bnf.fr/ark:/12148/cb133183738
narrower: cb11977042x
alternative label: Histoire mondiale
related: cb11933924p
scope note: Sous cette vedette, on trouve les documents sur la notion d'histoire universelle, ainsi que ceux qui retracent l'histoire mondiale, des origines à nos jours. Les documents sur la discipline historique en général sont sous Histoire
is part of: r166
related match: World history
modified: 2023-06-07
type: Concept
narrower: https://data.bnf.fr/ark:/12148/cb119456712
editorial note: Grand Robert de la langue française, 2001 (art. : Histoire). - . - Histoire universelle / R. Grousset, É.-G. Léonard, 1986. - . -
broader: https://data.bnf.fr/ark:/12148/cb119344445
related: cb11961809n
related: https://data.bnf.fr/ark:/12148/cb16683045c
narrower: cb17896261k
alternative label: Histoire de l'humanité