Sécurité sociale
created: 1985-07-06
editorial note: EUROVOC Thesaurus. - http://europa.eu/eurovoc. - 2009-05-04 Lexique des sciences sociales / M. Grawitz, 1994. - . - La sécurité sociale / G. Dorion, A. Guionnet, 2004. - . -
narrower: cb13319442h
alternative label: Régime général de Sécurité sociale
narrower: https://data.bnf.fr/ark:/12148/cb16150097d
narrower: cb11950045v
alternative label: Sécurité sociale -- Régime général
alternative label: Protection sociale
related match: Social security
alternative label: Couverture sociale
broader: https://data.bnf.fr/ark:/12148/cb119613961
related: https://data.bnf.fr/ark:/12148/cb122669588
modified: 2023-06-08
narrower: cb12043303v
narrower: https://data.bnf.fr/ark:/12148/cb11982876f
narrower: cb12147591n
narrower: cb11967802p
narrower: https://data.bnf.fr/ark:/12148/cb119822178
alternative label: Assurances sociales
related: https://data.bnf.fr/ark:/12148/cb14635324d
note: Ensemble des mesures collectives, légales, assurant des garanties contre certains risques sociaux : maladie, maternité, invalidité, vieillesse, etc.
type: Concept
related: cb11951140n
alternative label: Assurance sociale
narrower: cb13615210w
related: https://data.bnf.fr/ark:/12148/cb12126096b
broader: https://data.bnf.fr/ark:/12148/cb119498409
related: https://data.bnf.fr/ark:/12148/cb119761826
narrower: cb11967411j
narrower: https://data.bnf.fr/ark:/12148/cb119340353
related: https://data.bnf.fr/ark:/12148/cb119826688
alternative label: Prévoyance sociale
FRBNF: 11934328
scope note: Voir aussi les vedettes du type : Sécurité sociale -- [Catégorie d'assurés], par ex. : Sécurité sociale -- Fonctionnaires ; Sécurité sociale -- Travailleurs indépendants
domaine litteral: Problèmes et services sociaux. Criminologie
related: https://data.bnf.fr/ark:/12148/cb11964728c
related: https://data.bnf.fr/ark:/12148/cb150215884
editorial note: Grand Larousse universel (art. : Sécurité). - . - Encycl. universalis. - http://www.universalis-edu.com. - 2009-05-04
narrower: https://data.bnf.fr/ark:/12148/cb11937755c
P61160: http://www.rdaregistry.info/termList/statIdentification/1001
alternative label: Prestations sociales
is part of: r166