Subventions
alternative label: Aide de l'État
narrower: https://data.bnf.fr/ark:/12148/cb12098232d
alternative label: Subventions aux entreprises
alternative label: Industrie -- Subventions
related match: Subsidies
related match: Government aid
narrower: cb12534113h
related match: Federal aid
is part of: r166
domaine litteral: Économie politique. Travail
scope note: S'emploie également en subdivision. Cette subdivision s'applique aux industries et sujets noms communs approprés (activités recevant des subventions)
related: cb13318537z
type: Concept
related: https://data.bnf.fr/ark:/12148/cb121330150
alternative label: Aide des collectivités locales
related: https://data.bnf.fr/ark:/12148/cb119510751
FRBNF: 11934343
alternative label: Aides publiques
modified: 2023-06-07
narrower: cb12047940p
narrower: cb11954982h
alternative label: Aide de l'État aux entreprises
narrower: https://data.bnf.fr/ark:/12148/cb120115217
alternative label: Aide financière publique
narrower: cb12050383t
alternative label: Aides de l'État
narrower: cb12168038g
narrower: https://data.bnf.fr/ark:/12148/cb120631716
narrower: cb12311293s
narrower: cb12090629p
narrower: https://data.bnf.fr/ark:/12148/cb11995696f
alternative label: Industrie -- Aide de l'État
narrower: cb13196790s
broader: https://data.bnf.fr/ark:/12148/cb119510511
alternative label: Subsides
narrower: https://data.bnf.fr/ark:/12148/cb11969334d
related: cb13319365w
alternative label: Allocations financières
alternative label: Subvention
narrower: cb11975647t
alternative label: Aides des collectivités locales
scope note: Sous cette vedette, on trouve les documents sur tous les types d'aide publique
narrower: cb12112230s
related: cb11978969p
alternative label: Entreprises -- Subventions
related: https://data.bnf.fr/ark:/12148/cb11971670c
alternative label: Aide publique
alternative label: Aides financières des collectivités locales
narrower: cb12063220k
alternative label: Subventions à l'industrie
broader: https://data.bnf.fr/ark:/12148/cb119501187
alternative label: Aide de l'État à l'industrie
alternative label: Entreprises -- Aide de l'État
related: https://data.bnf.fr/ark:/12148/cb11934718f
P61160: http://www.rdaregistry.info/termList/statIdentification/1001
created: 1985-07-06
narrower: https://data.bnf.fr/ark:/12148/cb125277428
alternative label: Assistance économique intérieure
broader: https://data.bnf.fr/ark:/12148/cb12048166d
narrower: cb13196784v
editorial note: Grand Larousse universel. - . - Grand Robert de la langue française, 2001. - . -
alternative label: Aides financières de l'État
narrower: cb12192072t