Homme
related: https://data.bnf.fr/ark:/12148/cb133184815
note: Rang taxonomique : espèce
related: cb11949454w
related: cb11979599r
alternative label: Êtres humains
FRBNF: 11934882
domaine: cb11933834q
scope note: Sous cette vedette, on trouve les documents sur l'homme actuel (anciennement Homo sapiens sapiens). Les documents sur les Homo sapiens en général et sur les Homo sapiens fossiles en particulier se trouvent sous Homo sapiens. Les documents sur les hommes, individus mâles adultes, se trouvent sous Hommes
alternative label: Espèce humaine
related: https://data.bnf.fr/ark:/12148/cb13338423d
modified: 2023-06-07
related match: Human beings
P61160: http://www.rdaregistry.info/termList/statIdentification/1001
created: 1985-07-06
alternative label: Homme actuel
related: https://data.bnf.fr/ark:/12148/cb11932028b
is part of: r166
related: cb11976739q
alternative label: Genre humain
related: cb15006722j
alternative label: Homme moderne
related: https://data.bnf.fr/ark:/12148/cb119556551
related: cb11932029p
alternative label: Humain anatomiquement moderne
broader: https://data.bnf.fr/ark:/12148/cb119320270
scope note: Voir aussi les vedettes commencant par le mot Homme
alternative label: Homme de morphologie moderne
related: cb11930911m
domaine litteral: Archéologie. Préhistoire. Histoire ancienne
editorial note: Dict. d'anthropobiologie, 2005. - . - Au commencement était l'homme : de Toumaï à Cro-Magnon / P. Picq, 2003. - . - Homo : hist. plurielle d'un genre très singulier / C.-L. Gallien, 2002. - . -
related: cb11976108s
type: Concept
editorial note: Encycl. universalis (art. : Homo sapiens sapiens). - http://www.universalis-edu.com/encyclopedie. - 2016-06-14 Anthropobiologie : évolution humaine / É. Crubézy, J. Braga, G. Larrouy, 2008. - . -
alternative label: Être humain
alternative label: Homo sapiens actuels
related: cb11958000t
alternative label: Homo sapiens sapiens