Champagne (Ardèche, France)
P61160: http://www.rdaregistry.info/termList/statIdentification/1001
alternative label: Région Champagne-Ardenne (France)
alternative label: Champagne
alternative label: Champagne-Ardenne
alternative label: Champagne-Ardennes
alternative label: Champagne (Comté)
FRBNF: 15244970
focus: Champagne (Ardèche, France)
type: Concept
created: 1987-09-01
alternative label: Champagne (Province)
modified: 2017-05-03
broader: https://data.bnf.fr/ark:/12148/cb152383070

Champagne (Ardèche, France)
cadre geographique: cxam
lat long: E 4°48'5" / N 45°16'23"
coordonnees lambert: 07933 20333 +7933 33332 +2738 50303
code commune: 07051
reference IGN: Carte IGN à 1:50 000 : 3034 . Carte IGN à 1 :25 000 : 3034 W.
lat: 45.2730555555556
long: 4.80138888888889
type: SpatialThing
cadre geographique: cxamac

Champagne (France)
related: cb17023112j
narrower: https://data.bnf.fr/ark:/12148/cb119370067
narrower: cb11945068h
related: cb16569713j
related: https://data.bnf.fr/ark:/12148/cb125420896
type: Concept
related: cb17096145p
related: https://data.bnf.fr/ark:/12148/cb11969295b
related: cb16612505t
domaine litteral: Géographie de la France
modified: 2017-03-20
related: cb11942345z
note: Comté, puis province de la France (capitale : Troyes). Elle forme une région administrative (1956-1976) comprenant 4 départements : Ardennes, Aube, Haute-Marne et Marne (chef-lieu : Châlons-en-Champagne), et appelée Champagne, puis Champagne-Ardennes et enfin Champagne-Ardenne. Elle fusionne le 1er janvier 2016 avec l'Alsace et la Lorraine pour former le Grand-Est
narrower: https://data.bnf.fr/ark:/12148/cb119377619
editorial note: Grand Larousse universel. - . - Robert encyclopédique des noms propres 2008. - . -
is part of: r167
narrower: https://data.bnf.fr/ark:/12148/cb122182683
P61160: http://www.rdaregistry.info/termList/statIdentification/1001
narrower: cb11969202h
scope note: Voir aussi la subdivision Et la Champagne [sans subd. géogr.] aux collectivités et aux personnes
created: 1985-07-06
narrower: cb11937122r
FRBNF: 11936039
related: https://data.bnf.fr/ark:/12148/cb11949651d
narrower: cb11931650x

Champagne-Ardenne (France)