Catéchèse
narrower: https://data.bnf.fr/ark:/12148/cb119633417
scope note: S'emploie également en subdivision
alternative label: Catéchistique
alternative label: Catéchèse chrétienne
related: https://data.bnf.fr/ark:/12148/cb11934550c
domaine: cb13318807v
type: Concept
related: cb11953972z
narrower: https://data.bnf.fr/ark:/12148/cb12341614c
alternative label: Contribution à la catéchétique
alternative label: Contribution à la catéchèse
alternative label: Éducation religieuse chrétienne
narrower: https://data.bnf.fr/ark:/12148/cb119824003
alternative label: Enseignement catéchétique
modified: 2023-03-21
related: https://data.bnf.fr/ark:/12148/cb11934688b
narrower: https://data.bnf.fr/ark:/12148/cb11982518f
FRBNF: 11936072
alternative label: Catéchisme
narrower: cb11960446h
related: cb11947323v
narrower: cb11942389k
narrower: https://data.bnf.fr/ark:/12148/cb12651807c
created: 1985-07-06
broader: https://data.bnf.fr/ark:/12148/cb124898601
alternative label: Enseignement chrétien
narrower: https://data.bnf.fr/ark:/12148/cb119860499
narrower: https://data.bnf.fr/ark:/12148/cb119605819
related: https://data.bnf.fr/ark:/12148/cb119311271
narrower: https://data.bnf.fr/ark:/12148/cb11931128c
domaine: cb11963568t
narrower: cb11960543r
related match: Christian education
is part of: r166
narrower: cb11968522q
scope note: Sous cette vedette, on trouve les documents sur l'enseignement de la religion chrétienne (doctrine et morale chrétiennes). Les documents théoriques sur la nature, les buts, les méthodes de la catéchèse se trouvent sous Catéchétique. Les documents sur la formation générale de la personne aux valeurs du christianisme se trouvent sous Éducation chrétienne
editorial note: Dict. des mots de la foi chrétienne / O. de la Brosse, A.-M. Henry, P. Rouillard, 1992. - . - Encycl. du protestantisme / P. Gisel, L. Kaennel, 2006. - . - Dict. critique de théologie / J.-Y. Lacoste, 1998. - . -
narrower: https://data.bnf.fr/ark:/12148/cb119316905
broader: cb11969453z
editorial note: Nouveau Petit Robert 2010. - . - Le nouveau Théo : l'encycl. catholique pour tous / M. Dubost, S. Lalanne, 2009. - . -
narrower: https://data.bnf.fr/ark:/12148/cb119825173
narrower: cb11953990w
narrower: https://data.bnf.fr/ark:/12148/cb119605741
related: https://data.bnf.fr/ark:/12148/cb11956965d
P61160: http://www.rdaregistry.info/termList/statIdentification/1001