Construction
related: https://data.bnf.fr/ark:/12148/cb133183211
related: https://data.bnf.fr/ark:/12148/cb150227925
P61160: http://www.rdaregistry.info/termList/statIdentification/1001
narrower: https://data.bnf.fr/ark:/12148/cb119358675
narrower: https://data.bnf.fr/ark:/12148/cb13573865d
related: cb11936155g
alternative label: Costruzione @it
is part of: r166
related: cb11983167s
scope note: Voir aussi les vedettes commençant par Construction, par ex. : Construction en béton
related: https://data.bnf.fr/ark:/12148/cb133184590
narrower: cb16956423s
narrower: https://data.bnf.fr/ark:/12148/cb119317804
created: 1985-07-06
related: cb13162990r
narrower: https://data.bnf.fr/ark:/12148/cb119311527
narrower: cb12170681j
narrower: https://data.bnf.fr/ark:/12148/cb11977795f
alternative label: Travaux de construction
related: https://data.bnf.fr/ark:/12148/cb119760462
editorial note: Grand Larousse universel. - . - Dicobat 10 : dict. général du bâtiment / J. de Vigan, 2011. - . -
related: https://data.bnf.fr/ark:/12148/cb119788860
scope note: Sous cette vedette, on trouve les documents généraux sur la construction. Les documents sur l'industrie de la construction sont sous Construction -- Industrie
broader: https://data.bnf.fr/ark:/12148/cb119338890
domaine: cb11933639w
narrower: cb12086870x
related: cb11931778k
related: cb15967344s
modified: 2023-06-07
narrower: cb12170684k
FRBNF: 11936154
related: cb13572296s
narrower: cb11944348g
alternative label: Constructions -- Construction
related: cb11936156t
type: Concept

Building

Costruzione