Critique littéraire
related: https://data.bnf.fr/ark:/12148/cb170194207
narrower: cb11977060v
narrower: cb16934546t
narrower: https://data.bnf.fr/ark:/12148/cb119916687
narrower: https://data.bnf.fr/ark:/12148/cb11998691f
scope note: Voir aussi la subdivision Critique et exégèse aux livres sacrés
narrower: cb16976596p
narrower: cb11955170j
modified: 2023-06-07
P61160: http://www.rdaregistry.info/termList/statIdentification/1001
related: cb11945772p
is part of: r166
type: Concept
FRBNF: 11936172
related: https://data.bnf.fr/ark:/12148/cb119539870
created: 1985-07-06
has bibliography: biblio livre au crible juin23.pdf
narrower: cb12068460k
broader: cb12042895g
alternative label: Littérature -- Critique
editorial note: Encycl. universalis. - http://www.universalis-edu.com. - 2014-08-16 Encycl. de la littérature, 2003. - . -
narrower: cb12005901g
domaine litteral: Littérature générale
related: cb11932255s
scope note: Sous cette vedette, on trouve les documents sur la critique littéraire. Les documents sur les critiques littéraires en tant que personnes se trouvent sous Critiques littéraires
related: https://data.bnf.fr/ark:/12148/cb11939456c
related: https://data.bnf.fr/ark:/12148/cb16675880c
narrower: https://data.bnf.fr/ark:/12148/cb161470371
related: cb12206957p
narrower: https://data.bnf.fr/ark:/12148/cb16902792f
narrower: cb11945820q

Criticism