Art publicitaire
domaine: cb11931640m
domaine: cb11950206h
related: https://data.bnf.fr/ark:/12148/cb122544466
related: https://data.bnf.fr/ark:/12148/cb13318427c
alternative label: Dessin publicitaire
alternative label: Art commercial
alternative label: Publicité, Art dans la
P61160: http://www.rdaregistry.info/termList/statIdentification/1001
related: https://data.bnf.fr/ark:/12148/cb119409485
narrower: https://data.bnf.fr/ark:/12148/cb119477756
FRBNF: 11938021
modified: 2023-06-07
type: Concept
created: 1985-07-06
alternative label: Art dans la publicité
related: cb17701914r
broader: cb11931640m
related: cb11977913t
is part of: r166
editorial note: Traité d'art publicitaire et des arts graphiques / M. Caboni, 1950. - . - Réclames : l'art du dessin publicitaire dans la presse des années 1950-1970 / A. Lachartre, 2013. - . - Le graphisme au XXe siècle / R. Hollis,1997. - . -
scope note: Voir aussi aux noms des objets publicitaires, par ex. : Automates publicitaires

Commercial art