Découverte et exploration espagnoles -- Amérique
alternative label: Amérique -- Découverte et exploration espagnoles
related: https://data.bnf.fr/ark:/12148/cb12653743f
modified: 2019-05-22
related: cb17157817z
created: 1985-07-06
scope note: Voir aussi la subdivision Découverte et exploration espagnoles [sans subd. géogr.] aux lieux, par ex. : Amérique du Nord -- Découverte et exploration espagnoles
broader: https://data.bnf.fr/ark:/12148/cb12011449b
narrower: cb12505319r
P61160: http://www.rdaregistry.info/termList/statIdentification/1001
type: Concept
is part of: r167
broader: cb12417772t
is part of: r166
domaine litteral: Histoire du reste du monde
FRBNF: 11938087
domaine litteral: Géographie du reste du monde

America -- Discovery and exploration -- Spanish