Religion et littérature
scope note: Voir aussi la subdivision Religion aux personnes (écrivains)
narrower: https://data.bnf.fr/ark:/12148/cb124010680
related: https://data.bnf.fr/ark:/12148/cb133196275
narrower: https://data.bnf.fr/ark:/12148/cb119790594
FRBNF: 11938218
alternative label: Théologie et littérature
related match: Religion and literature
created: 1985-07-06
alternative label: Littérature et théologie
is part of: r166
narrower: https://data.bnf.fr/ark:/12148/cb119553060
narrower: cb12381237r
domaine litteral: Littérature générale
narrower: cb12652838w
related: https://data.bnf.fr/ark:/12148/cb165676682
related: cb13318503n
related: https://data.bnf.fr/ark:/12148/cb11939456c
scope note: Sous cette vedette, on trouve les documents sur les relations entre la religion et la littérature en général
editorial note: Dict. du littéraire / P. Aron, D. Saint-Jacques, A. Viala, 2002 (art. : Religion). - . - Dict. universel des littératures / B. Didier, 1994 (art. : Religion et littérature - France/XVIIe s.). - . - Littérature et religion au Moyen âge et à la Renaissance / J.-C. Vallecalle, 1997. - . -
P61160: http://www.rdaregistry.info/termList/statIdentification/1001
related: cb11942380g
narrower: cb14509896t
alternative label: Littérature et religion
narrower: cb11963438m
domaine: cb11963568t
related: cb11963568t
related: cb11980057g
modified: 2023-06-08
narrower: cb15620148k
narrower: cb12542659x
type: Concept