Statistique
narrower: cb12343689r
scope note: Sous cette vedette, on trouve les ouvrages sur la statistique en tant que science. Les recueils généraux et mondiaux de statistiques se trouvent sous la vedette Statistiques
narrower: cb12067094j
narrower: cb11978503n
related: cb12042412v
FRBNF: 11938470
narrower: https://data.bnf.fr/ark:/12148/cb119784637
narrower: cb11956416t
narrower: https://data.bnf.fr/ark:/12148/cb181072011
broader: cb11975727g
related: cb11931935v
P61160: http://www.rdaregistry.info/termList/statIdentification/1001
narrower: https://data.bnf.fr/ark:/12148/cb119791195
narrower: https://data.bnf.fr/ark:/12148/cb119318467
narrower: cb11948225h
narrower: cb12456866r
narrower: cb12424410x
narrower: https://data.bnf.fr/ark:/12148/cb119445648
narrower: cb11958255n
narrower: https://data.bnf.fr/ark:/12148/cb122658620
narrower: https://data.bnf.fr/ark:/12148/cb124032906
narrower: cb12355597s
related: https://data.bnf.fr/ark:/12148/cb166379104
type: Concept
created: 1985-07-06
narrower: https://data.bnf.fr/ark:/12148/cb119445857
narrower: cb11983125v
modified: 2023-06-07
narrower: https://data.bnf.fr/ark:/12148/cb11978905f
narrower: https://data.bnf.fr/ark:/12148/cb12076887f
narrower: cb12653665g
related match: Statistics
domaine: https://data.bnf.fr/ark:/12148/cb11932434c
related: cb17149698h
narrower: cb12506375g
scope note: Voir aussi les vedettes commençant par le mot Statistique, par ex. Statistique commerciale ; Statistique médicale ; etc. pour les méthodes statistiques appliquées à certaines grandes disciplines
narrower: https://data.bnf.fr/ark:/12148/cb119440599
narrower: https://data.bnf.fr/ark:/12148/cb170896803
is part of: r166
alternative label: Statistique économique
narrower: cb12127529t
narrower: https://data.bnf.fr/ark:/12148/cb123837008
related: https://data.bnf.fr/ark:/12148/cb119563067
narrower: https://data.bnf.fr/ark:/12148/cb166831658
narrower: cb12093270r
alternative label: Méthodes d'analyse statistique
narrower: cb11932639n
alternative label: Statistique descriptive
narrower: https://data.bnf.fr/ark:/12148/cb12521879f
narrower: https://data.bnf.fr/ark:/12148/cb119587400
narrower: cb11978229h
alternative label: Analyse statistique
scope note: Voir aussi la subdivision Méthodes statistiques à tous sujets noms communs
narrower: https://data.bnf.fr/ark:/12148/cb119666602
related: https://data.bnf.fr/ark:/12148/cb133184846
narrower: https://data.bnf.fr/ark:/12148/cb144626970