Arménie
related: https://data.bnf.fr/ark:/12148/cb121180551
related: cb11936986z
broader: cb12250634s
type: Concept
editorial note: Grand Larousse universel. - . - Robert encyclopédique des noms propres 2008. - . - Encycl. universalis. - http://www.universalis-edu.com. - 2011-01-11
P61160: http://www.rdaregistry.info/termList/statIdentification/1001
related: https://data.bnf.fr/ark:/12148/cb119378680
related: cb12503876g
domaine litteral: Géographie du reste du monde
related: https://data.bnf.fr/ark:/12148/cb133232134
is part of: r167
related: https://data.bnf.fr/ark:/12148/cb125342384
FRBNF: 11938503
scope note: Voir aussi la subdivision Et l'Arménie [sans subd. géogr.] aux collectivités et aux personnes
related: cb12354552k
related: cb12534237s
created: 1985-07-06
related: https://data.bnf.fr/ark:/12148/cb119430759
broader: https://data.bnf.fr/ark:/12148/cb119483353
related: https://data.bnf.fr/ark:/12148/cb15642202f
scope note: Sous cette vedette, on trouve les documents sur l'ensemble de l'Arménie, ou sur sa seule partie orientale annexée par la Russie en 1828, qui constitue depuis 1991 une république indépendante
modified: 2011-01-11
related: https://data.bnf.fr/ark:/12148/cb119791253
related: cb12567260n
related: https://data.bnf.fr/ark:/12148/cb121364792

Arménie
alternative label: Armenija
alternative label: Hajastan
FRBNF: 15342592
alternative label: Hayastan
focus: Arménie
modified: 2017-06-23
alternative label: Arménie (République socialiste soviétique)
alternative label: Hayasdan
type: Concept
alternative label: Aïastan
P61160: http://www.rdaregistry.info/termList/statIdentification/1001
created: 1999-04-29
alternative label: Arménie (République)
alternative label: Arménie (1991-)
related: https://data.bnf.fr/ark:/12148/cb15238308b
alternative label: Haïk
alternative label: Arménie (Royaume)
alternative label: Grande Arménie

Arménie
cadre geographique: cwch
lat: 38.8333333333333
long: 46.6666666666667
lat: 41.3333333333333
lat long: E 43°25' - E 46°40' / N 41°20' - N 38°50'
type: SpatialThing
long: 43.4166666666667