Pèlerinages
domaine: cb11955444t
broader: https://data.bnf.fr/ark:/12148/cb11961511c
related: https://data.bnf.fr/ark:/12148/cb119405273
editorial note: Dict. des faits religieux / R. Azria, D. Hervieu-Léger, 2010. - . - Dict. encyclopédique de l'islam / C. Glassé, 1991. - . - Encycl. des religions / F. Lenoir, Y. Tardan-Masquelier, 1997. - . -
modified: 2019-01-05
related: cb17029504g
related: https://data.bnf.fr/ark:/12148/cb11979805d
FRBNF: 11940247
broader: https://data.bnf.fr/ark:/12148/cb126532730
related: https://data.bnf.fr/ark:/12148/cb120091911
is part of: r166
created: 1985-07-06
scope note: Voir aussi les vedettes du type Pèlerinages [adjectif de religion], par ex. : Pèlerinages chrétiens
P61160: http://www.rdaregistry.info/termList/statIdentification/1001
broad match: Pilgrims and pilgrimages
related: cb11949807g
editorial note: Grand Larousse universel. - . - Encycl. universalis. - http://www.universalis-edu.com. - 2016-02-26
alternative label: Pèlerinage
type: Concept
domaine: cb11963568t