Vie sexuelle
domaine: https://data.bnf.fr/ark:/12148/cb119408497
domaine litteral: Anthropologie. Ethnologie
related: cb11936576j
alternative label: Anthropologie sexuelle
narrower: cb16600667z
alternative label: Sexualité -- Aspect social
scope note: Sous cette vedette, on trouve les documents sur l'aspect culturel des relations sexuelles et sur la place de la sexualité dans la société. Les documents sur le comportement sexuel individuel se trouvent sous Sexualité. Les documents sur l'aspect physique et physiologique de la sexualité se trouvent sous Relations sexuelles
alternative label: Coutumes sexuelles
alternative label: Relations sexuelles -- Anthropologie
narrower: cb16558787n
created: 1985-07-06
related: cb11965617p
modified: 2023-06-07
related: cb17895009p
is part of: r166
scope note: Voir aussi la subdivision Sexualité aux groupes ethniques
alternative label: Vie sexuelle -- Aspect social
related: cb11947780s
narrower: cb16654230h
domaine litteral: Sciences sociales. Sociologie
alternative label: Rites sexuels
FRBNF: 11940674
alternative label: Relations sexuelles -- Aspect social
alternative label: Vita sessuale @it
related: cb12318825n
alternative label: Sexualité -- Anthropologie
type: Concept
narrower: https://data.bnf.fr/ark:/12148/cb161265143
related: https://data.bnf.fr/ark:/12148/cb11935982b
alternative label: Vie sexuelle -- Anthropologie
editorial note: La sexualité et sa répression dans les sociétés primitives / B. Malinowski, 1990. - . - Atlas de la sexualité dans le monde : similitudes et différences dans les comportements et les valeurs / J. MacKay, 2000. - . - Les sexualités : répression, tolérance, indifférence : actes du colloque tenu à Toulon les 13, 14 et 15 novembre 2008 / Centre de droit et de politique comparés Jean-Claude Escarras, UMR-CNRS 7318, Université du Sud Toulon-Var, 2012. - . -
broader: https://data.bnf.fr/ark:/12148/cb11932512b
related: cb11933266p
narrower: https://data.bnf.fr/ark:/12148/cb119495994
alternative label: Moeurs sexuelles
related: cb12271601g
P61160: http://www.rdaregistry.info/termList/statIdentification/1001

Vita sessuale

Sex customs