Administration scolaire
narrower: cb12653214g
domaine: cb13318807v
narrower: cb15902312q
narrower: https://data.bnf.fr/ark:/12148/cb11971084d
narrower: cb16909447g
alternative label: Ecoles -- Organisation
narrower: cb11981853j
narrower: cb11965905h
alternative label: Administration de l'enseignement
narrower: cb11978107x
alternative label: Enseignement -- Administration
narrower: https://data.bnf.fr/ark:/12148/cb11956340d
narrower: https://data.bnf.fr/ark:/12148/cb126993590
related: cb11942602h
narrower: https://data.bnf.fr/ark:/12148/cb170146824
alternative label: Education -- Administration et organisation
related: https://data.bnf.fr/ark:/12148/cb119365307
scope note: Voir aussi la subdivision Administration aux collectivités (établissements d'enseignement)
narrower: https://data.bnf.fr/ark:/12148/cb119799468
narrower: cb11965809m
alternative label: Organisation scolaire
is part of: r166
narrower: cb12688515g
narrower: https://data.bnf.fr/ark:/12148/cb120107624
type: Concept
broader: https://data.bnf.fr/ark:/12148/cb11939892b
alternative label: Ecoles -- Direction et organisation
broader: cb11950206h
modified: 2018-09-11
narrower: https://data.bnf.fr/ark:/12148/cb119563396
related match: School management and organisation
related: cb14530002w
alternative label: Intendance scolaire
FRBNF: 11940923
narrower: https://data.bnf.fr/ark:/12148/cb15656364f
related: https://data.bnf.fr/ark:/12148/cb120423190
narrower: https://data.bnf.fr/ark:/12148/cb119613543
alternative label: Ecoles -- Administration
P61160: http://www.rdaregistry.info/termList/statIdentification/1001
narrower: cb15116070v
created: 1985-07-06
narrower: cb11966881k