Franc-maçonnerie
FRBNF: 11941193
editorial note: Grand Larousse universel. - . - Dict. de la franc-maçonnerie / D. Ligou, 1991. - . -
is part of: r166
narrower: https://data.bnf.fr/ark:/12148/cb119610548
narrower: cb12111092j
narrower: https://data.bnf.fr/ark:/12148/cb16661928c
narrower: https://data.bnf.fr/ark:/12148/cb119739773
related match: Anti-Masonic movements
narrower: https://data.bnf.fr/ark:/12148/cb16500131d
narrower: https://data.bnf.fr/ark:/12148/cb12226946f
broader: https://data.bnf.fr/ark:/12148/cb131626662
alternative label: Ordres maçonniques
domaine litteral: Ésotérisme. Parapsychologie
narrower: https://data.bnf.fr/ark:/12148/cb11991515c
scope note: S'emploie également en subdivision. Cette subdivision s'applique aux personnes
narrower: cb15017484q
related: cb12443718p
narrower: cb12372128j
narrower: https://data.bnf.fr/ark:/12148/cb120431724
narrower: https://data.bnf.fr/ark:/12148/cb166620284
narrower: cb11961053x
scope note: Voir aussi aux noms des obédiences et loges particulières
narrower: https://data.bnf.fr/ark:/12148/cb12073321d
narrower: cb11965624z
modified: 2023-06-07
related: https://data.bnf.fr/ark:/12148/cb150388389
type: Concept
related: cb11975320z
alternative label: Et la franc-maçonnerie
narrower: cb16661980g
alternative label: Antimaçonnisme
related: cb17989995h
narrower: https://data.bnf.fr/ark:/12148/cb119344565
P61160: http://www.rdaregistry.info/termList/statIdentification/1001
narrower: https://data.bnf.fr/ark:/12148/cb124946160
related: cb12573798z
related: https://data.bnf.fr/ark:/12148/cb14470110f
narrower: cb11961052k
created: 1985-07-06
related: cb11971434z
broader: https://data.bnf.fr/ark:/12148/cb119466552
alternative label: Maçonnerie (franc-maçonnerie)
domaine litteral: Problèmes et services sociaux. Criminologie
related: https://data.bnf.fr/ark:/12148/cb11973978f
related match: Freemasonry