Simulation par ordinateur
alternative label: Simulation numérique
is part of: r166
domaine: https://data.bnf.fr/ark:/12148/cb11932109b
broader: cb11956771s
related: https://data.bnf.fr/ark:/12148/cb15577164c
broader: https://data.bnf.fr/ark:/12148/cb119401913
related match: Digital computer simulation
scope note: Sous cette vedette, on trouve les documents sur les simulations sur ordinateurs de systèmes et de processus, mettant en jeu la formulation d'un modèle mathématique, sa conversion en un logiciel, et l'exécution d'expériences avec le modèle informatique pour la compréhension, l'évaluation ou la modification du système ou du processus concerné
scope note: S'emploie également en subdivision à tous sujets noms communs
alternative label: Simulation sur calculateur numérique
narrower: https://data.bnf.fr/ark:/12148/cb137465384
domaine: https://data.bnf.fr/ark:/12148/cb11932434c
modified: 2023-06-08
broader: cb11933269q
alternative label: Simulation par calculateur numérique
type: Concept
alternative label: Simulazione <Elaborazione elettronica> @it
FRBNF: 11941226
narrower: cb15584795s
narrower: cb12313763q
alternative label: Simulation graphique par ordinateur
P61160: http://www.rdaregistry.info/termList/statIdentification/1001
narrower: cb18101336h
related: https://data.bnf.fr/ark:/12148/cb12266622f
narrower: cb17704570v
related: https://data.bnf.fr/ark:/12148/cb133259900
alternative label: Simulation visuelle par ordinateur
related match: Computer simulation
narrower: cb11932084t
created: 1985-07-06
related: cb16615419z
alternative label: Simulation sur ordinateur
narrower: cb11933350k
narrower: cb17115722z

Simulazione <Elaborazione elettronica>