Industries énergétiques
FRBNF: 11941858
related: https://data.bnf.fr/ark:/12148/cb119327613
alternative label: Énergie -- Industrie et commerce
broader: cb11975704t
narrower: https://data.bnf.fr/ark:/12148/cb13162703f
scope note: Voir aussi la subdivision Industrie et commerce aux ressources énergétiques, par ex. : Biogaz -- Industrie et commerce
narrower: cb11982856t
narrower: https://data.bnf.fr/ark:/12148/cb11941873b
alternative label: Ressources énergétiques -- Industrie et commerce
P61160: http://www.rdaregistry.info/termList/statIdentification/1001
domaine: cb11933127h
domaine: cb11933639w
alternative label: Industrie énergétique
related: https://data.bnf.fr/ark:/12148/cb119314344
related: cb11974106m
narrower: cb16731997r
type: Concept
modified: 2018-12-07
is part of: r166
narrower: https://data.bnf.fr/ark:/12148/cb119556509
domaine litteral: Économie politique. Travail
narrower: cb16988790v
alternative label: Secteur énergétique
narrower: cb11932104m
created: 1985-07-06
narrower: https://data.bnf.fr/ark:/12148/cb15061794f
narrower: cb11938356v

Energy industries