Russes
narrower: https://data.bnf.fr/ark:/12148/cb120119847
is part of: r166
type: Concept
related: cb11993770j
narrower: https://data.bnf.fr/ark:/12148/cb150831742
narrower: https://data.bnf.fr/ark:/12148/cb14523819b
narrower: cb15021361j
narrower: cb12199818x
narrower: https://data.bnf.fr/ark:/12148/cb125461910
narrower: https://data.bnf.fr/ark:/12148/cb123893269
narrower: cb12263030p
related: https://data.bnf.fr/ark:/12148/cb119405184
broader: cb11979311z
narrower: https://data.bnf.fr/ark:/12148/cb121312857
narrower: https://data.bnf.fr/ark:/12148/cb165618921
created: 1985-07-06
narrower: https://data.bnf.fr/ark:/12148/cb162419106
related: cb13544076g
narrower: https://data.bnf.fr/ark:/12148/cb166801437
narrower: cb11976877j
narrower: https://data.bnf.fr/ark:/12148/cb121625539
narrower: cb17907157m
related: cb15829453h
narrower: https://data.bnf.fr/ark:/12148/cb15083082d
narrower: cb12180653h
narrower: https://data.bnf.fr/ark:/12148/cb180002375
scope note: Sous cette vedette, obligatoirement suivie d'une subdivision géographique ou de la subdivision : À l'étranger, directement ou après une subdivision de sujet, on trouve les documents sur les Russes hors de Russie. Les documents sur les Russes en Russie se trouvent sous des vedettes-matière telles que : Russie -- Moeurs et coutumes ; etc.
narrower: https://data.bnf.fr/ark:/12148/cb166477296
narrower: cb12139070k
narrower: https://data.bnf.fr/ark:/12148/cb120283505
narrower: cb16696842g
related match: Russians
narrower: cb12085702x
domaine: cb12648641g
modified: 2018-09-11
narrower: https://data.bnf.fr/ark:/12148/cb120115755
P61160: http://www.rdaregistry.info/termList/statIdentification/1001
FRBNF: 11942615
narrower: cb16179607v
related: cb12031410q
narrower: https://data.bnf.fr/ark:/12148/cb12008646b
related: https://data.bnf.fr/ark:/12148/cb122267028