Bibliothèques universitaires
scope note: Voir aussi aux bibliothèques universitaires particulières, par ex. : Université de Bretagne occidentale. Bibliothèque
alternative label: Bibliothèques interuniversitaires
type: Concept
alternative label: SCD
broader: https://data.bnf.fr/ark:/12148/cb13318325d
related: cb11947999r
domaine litteral: Urbanisme. Architecture du paysage
broader: https://data.bnf.fr/ark:/12148/cb13319688c
editorial note: Les bibliothèques universitaires / J.-P. Casseyre, C. Gaillard, 1996. - . - Les bibliothèques universitaires : rapport / Ministère l'éducation nationale, de la jeunesse et des sports / A. Miquel, 1989. - . - Autonomie universitaire et mutualisation : le cas des bibliothèques interuniversitaires / Inspection générale des bibliothèques, 2009. - . -
alternative label: Bibliothèques de facultés
related: https://data.bnf.fr/ark:/12148/cb11971051f
related: https://data.bnf.fr/ark:/12148/cb124115735
domaine: https://data.bnf.fr/ark:/12148/cb119361544
related: https://data.bnf.fr/ark:/12148/cb11945347c
alternative label: Bibliothèques d'enseignement supérieur
domaine: https://data.bnf.fr/ark:/12148/cb133183211
P61160: http://www.rdaregistry.info/termList/statIdentification/1001
modified: 2023-06-08
is part of: r166
related: https://data.bnf.fr/ark:/12148/cb125461047
related: https://data.bnf.fr/ark:/12148/cb133207295
alternative label: Services interétablissements de coopération documentatire
domaine litteral: Sciences de l'information et de la documentation
alternative label: Universités -- Services communs de documentation
alternative label: Universités -- Services interétablissements de coopération documentaire
FRBNF: 11943978
alternative label: Bibliothèques d'universités
related: cb11979593p
related: https://data.bnf.fr/ark:/12148/cb11933731d
alternative label: SICD
related: cb11955681k
domaine: cb13318807v
editorial note: Grand Larousse universel (art. : Bibliothèque). - . - Bibliothèques universitaires : nouveaux horizons / F. Cavalier, M. Poulain, 2015. - . -
alternative label: Universités -- Bibliothèques
alternative label: Services communs de la documentation
related: cb11953460k
alternative label: Services communs de documentation
created: 1985-07-06

Academic libraries