Parents et enfants
narrower: https://data.bnf.fr/ark:/12148/cb171102660
narrower: cb12518080x
narrower: https://data.bnf.fr/ark:/12148/cb120685031
related: cb15770193m
related: https://data.bnf.fr/ark:/12148/cb119319486
broader: https://data.bnf.fr/ark:/12148/cb122936439
modified: 2023-06-07
alternative label: Relations enfants-parents
P61160: http://www.rdaregistry.info/termList/statIdentification/1001
narrower: cb16078963r
alternative label: Famille et enfants
narrower: cb15563833v
narrower: https://data.bnf.fr/ark:/12148/cb12407200c
related: cb16647500x
domaine: https://data.bnf.fr/ark:/12148/cb119408497
created: 1985-07-06
narrower: cb15887671r
related: https://data.bnf.fr/ark:/12148/cb119466610
alternative label: Relations entre enfants et parents
FRBNF: 11946662
alternative label: Enfants et parents
related: cb13319058s
narrower: https://data.bnf.fr/ark:/12148/cb17780106b
narrower: https://data.bnf.fr/ark:/12148/cb122834755
narrower: https://data.bnf.fr/ark:/12148/cb11936449c
related: https://data.bnf.fr/ark:/12148/cb119319811
broader: https://data.bnf.fr/ark:/12148/cb12649733c
narrower: https://data.bnf.fr/ark:/12148/cb17700433d
scope note: Sous cette vedette, on trouve les documents sur l'interaction psycho-sociale entre parents et enfants. Les documents sur les méthodes d'éducation se trouvent sous Éducation des enfants. Les documents sur les qualités et attitudes psychologiques et pédagogiques souhaitables se trouvent sous Rôle parental
narrower: https://data.bnf.fr/ark:/12148/cb119324858
narrower: https://data.bnf.fr/ark:/12148/cb119364915
is part of: r166
narrower: cb12194404x
narrower: cb12310368m
narrower: cb16665779p
narrower: cb17804623s
alternative label: Enfants et famille
alternative label: Dialogue parents-enfants
narrower: cb16925173n
type: Concept
narrower: https://data.bnf.fr/ark:/12148/cb136035283
alternative label: Conflits parents-enfants
narrower: https://data.bnf.fr/ark:/12148/cb119776506
narrower: https://data.bnf.fr/ark:/12148/cb17070417d
alternative label: Comportement parental
narrower: https://data.bnf.fr/ark:/12148/cb119814496
narrower: https://data.bnf.fr/ark:/12148/cb15852453f
broader: https://data.bnf.fr/ark:/12148/cb119339867
alternative label: Relations parents-enfants
related: cb11935219n
narrower: cb17790862z
narrower: cb11979827q
alternative label: Parents -- Comportement
alternative label: Relations entre parents et enfants
narrower: cb14615987j
scope note: Voir aussi les vedettes du type : Enfants de [catégorie de parents], par ex. : Enfants de prisonniers

Parent and child