Économie politique -- Histoire
narrower: https://data.bnf.fr/ark:/12148/cb119620237
narrower: cb11965188t
domaine: https://data.bnf.fr/ark:/12148/cb119344445
narrower: https://data.bnf.fr/ark:/12148/cb13770082d
alternative label: Pensée économique -- Histoire
narrower: cb12048089s
related: cb16083597z
narrower: https://data.bnf.fr/ark:/12148/cb131802108
narrower: cb11953280n
type: Concept
narrower: cb12441603w
is part of: r166
narrower: https://data.bnf.fr/ark:/12148/cb119321785
scope note: Sous cette vedette, on trouve les documents qui traitent de l'histoire de la discipline : histoire des doctrines économiques. Les documents sur l'histoire de l'économie mondiale et des conditions économiques se trouvent sous la vedette Histoire économique pour des études générales, et aux lieux suivis de la subdivision Conditions économiques pour des études localisées
narrower: https://data.bnf.fr/ark:/12148/cb120902225
domaine litteral: Économie politique. Travail
narrower: cb11934142n
narrower: cb12050036g
narrower: https://data.bnf.fr/ark:/12148/cb119720285
alternative label: Histoire de la pensée économique
created: 1985-07-06
narrower: cb11961083v
narrower: https://data.bnf.fr/ark:/12148/cb16687860f
narrower: cb11934164z
narrower: https://data.bnf.fr/ark:/12148/cb125067042
P61160: http://www.rdaregistry.info/termList/statIdentification/1001
narrower: cb12182387g
narrower: cb11932330q
narrower: cb12189377v
FRBNF: 11950160
narrower: cb11952768x
narrower: https://data.bnf.fr/ark:/12148/cb124734023
modified: 2021-09-20

Economics--History