Successions et héritages
narrower: https://data.bnf.fr/ark:/12148/cb119804149
alternative label: Successions
narrower: cb15038140x
narrower: cb12011042t
related: https://data.bnf.fr/ark:/12148/cb16207659b
narrower: cb12225959j
narrower: cb11980415n
narrower: https://data.bnf.fr/ark:/12148/cb120235704
alternative label: Droit des successions
alternative label: Biens successoraux
narrower: https://data.bnf.fr/ark:/12148/cb121650649
narrower: https://data.bnf.fr/ark:/12148/cb119829176
narrower: cb11971671q
broader: https://data.bnf.fr/ark:/12148/cb11980255b
alternative label: Héritiers
narrower: cb16654912h
narrower: cb12165338k
narrower: https://data.bnf.fr/ark:/12148/cb119827467
narrower: cb17111751k
related: cb11932940p
FRBNF: 11951178
alternative label: Successioni @it
P61160: http://www.rdaregistry.info/termList/statIdentification/1001
narrower: cb11980418p
related: cb16652439p
narrower: https://data.bnf.fr/ark:/12148/cb120983331
narrower: cb12163523m
narrower: cb15567752t
scope note: Voir aussi les subdivisions Patrimoine et Testaments aux personnes
is part of: r166
narrower: https://data.bnf.fr/ark:/12148/cb124124734
type: Concept
narrower: cb11967370s
narrower: https://data.bnf.fr/ark:/12148/cb12122312b
narrower: https://data.bnf.fr/ark:/12148/cb119804160
narrower: cb12098738v
created: 1985-07-06
alternative label: Héritage
narrower: https://data.bnf.fr/ark:/12148/cb12010195f
alternative label: Patrimoine successoral
narrower: https://data.bnf.fr/ark:/12148/cb11980417b
alternative label: Dévolution successorale
narrower: cb11983561t
modified: 2018-09-11
broader: cb12649852x
narrower: cb12412466v
narrower: cb12134350k
related: https://data.bnf.fr/ark:/12148/cb166791060
narrower: https://data.bnf.fr/ark:/12148/cb169196446
related match: Inheritance and succession
domaine: cb13318687s
alternative label: Héritages
alternative label: Transmission successorale
alternative label: Succession (droit)
narrower: cb16778187r
narrower: https://data.bnf.fr/ark:/12148/cb126533242
alternative label: Droit de succession
narrower: https://data.bnf.fr/ark:/12148/cb119356699
narrower: https://data.bnf.fr/ark:/12148/cb120986137
narrower: cb12165453r
alternative label: Droit successoral

Successioni