Religion romaine
alternative label: Rome -- Religion romaine
narrower: https://data.bnf.fr/ark:/12148/cb17721707b
narrower: cb12144434t
related: cb12127571m
narrower: cb17723983g
P61160: http://www.rdaregistry.info/termList/statIdentification/1001
is part of: r166
related: cb11931196v
broader: cb11936754s
narrower: cb11980884k
scope note: Sous cette vedette, on trouve les documents sur la religion romaine antique. Les documents sur l'ensemble des religions du monde romain antique se trouvent sous Religions -- Rome
related: cb12136706p
related: cb15721286t
broad match: Rome--Religion
domaine: cb11963568t
broader: cb16271420r
modified: 2019-02-07
related: cb11977980z
is part of: r167
narrower: cb12039870m
domaine litteral: Archéologie. Préhistoire. Histoire ancienne
type: Concept
editorial note: Hist. des religions / H.-C. Puech, 1970. - . - Dict. des religions / P. Poupard, 1984 (art. : Romaine, religion). - . - Lexique d'histoire et de civilisation romaine / J. L. Lamboley, 1995. - . -
narrower: cb12209562w
created: 1985-07-06
narrower: cb12396924r
related: https://data.bnf.fr/ark:/12148/cb12117201d
editorial note: Grand Larousse universel. - . - Encycl. universalis (art. : Rome et empire romain. La religion romaine). - http://www.universalis-edu.com. - 2011-09-23
related: https://data.bnf.fr/ark:/12148/cb162281797
narrower: cb11960092k
scope note: S'emploie également en subdivision. Cette subdivision s'applique aux sujets religieux
narrower: cb12117202r
FRBNF: 11963572